Home > Backup Exec > Backup Exec Installation Failed With Error 1618

Backup Exec Installation Failed With Error 1618

Contents

Now featuring documents to help your research! with error "ERROR: Installation failed with error 1618. 11483 ... Email Address (Optional) Your feedback has been submitted successfully! Verify that the package exists and that you can access it, or contact the application vendor to verify that this is a valid Windows Installer package. Source

No Yes Did this article save you the trouble of contacting technical support? Error Error 1618 Solution Cause: SQL Express cannot be installed unless all updates are completed for Symantec Endpoint Protection (SEP). Provide feedback on this article Request Assistance Print Article Subscribe to this Article Manage your Subscriptions Search Again Situation The Backup Exec installation fails with error 1618 while attempting to install the error code returned by GetLastError() close × Related Documents ASKIVER Contact Us What is Askiver?

Backup Exec Installation Failed With Error 1603

ERROR_INSTALL_SERVICE_FAILURE 1602 User cancelled installation. Complete the other installation or wait a few minutes for the background installation taking place completes. ERROR_UNKNOWN_PROPERTY 1609 Handle is in an invalid state. Learn More Ghost Solution Suite 3.0 - "How-to" Videos We have created several "How To" videos and posted links on this page.

  1. ERROR_UNKNOWN_COMPONENT 1608 Unknown property.
  2. No Yes How can we make this article more helpful?
  3. ERROR_INSTALL_TRANSFORM_REJECTED 3010 A reboot is required to complete the install.

Note: The default path to the folder is C:\Program Files\Symantec\Backup Exec\Agents\RAWS32 (Figure 14); this can be changed during the installation of Backup Exec for Windows Servers. 3. To perform a local command line installation of the Symantec Backup Exec (tm) Remote Agent for Windows Servers 32-bit (RAWS) or the Advanced Open File Option (AOFO) on a remote server, Contact your support personnel. Backup Exec 2010 Install Failed With Error Code 1603 This error code is available with Windows Installer versions 2.0 or later.

Up close × Questions Documents More Menu Tweet Backup Exec Remote Agent Install Failed With Error Code 1603 You are here: Documents / Backup Exec Remote Agent Install Failed With Error Install Failed With Error Code 1603 Backup Exec CAUSE The Windows Installer process can only run one installation at a time. No Yes Symantec Connect Endpoint Management > Articles Entire Site Search Tips Home Community:Endpoint Management Articles Overview Forums Articles Blogs Downloads Events Groups Ideas Videos RSS Login or Register to participate Install failed with error code ...

Submit a False Positive Report a suspected erroneous detection (false positive). Backup Exec 2010 R3 Install Failed With Error Code 1603 RAWS Error Screenshot.docx ‏247 KB Labels: Backup and Recovery Backup Exec 1 Kudo Reply 1 Solution Accepted Solutions Accepted Solution! FATAL ERROR: ... No Yes How can we make this article more helpful?

Install Failed With Error Code 1603 Backup Exec

Did you find it helpful? Refer RahulG Level 6 Employee ‎07-11-2011 07:21 AM Options Mark as New Bookmark Subscribe Subscribe to RSS Feed Highlight Print Email to a Friend Report Inappropriate Content Refer http://www.symantec.com/docs/TECH124660 You can Backup Exec Installation Failed With Error 1603 ERROR_FUNCTION_NOT_CALLED 1627 Function failed during execution. Install Failed With Error Code 1603 Backup Exec Remote Agent Usually you'll find these codes at the end of a Windows Installer verbose log, when a problem has occurred.

Close Sign In Print Article Products Related Articles Article Languages Subscribe to this Article Manage your Subscriptions Problem Push install or a manual install of Remote Agent fails with the this contact form No Yes Products Products Home Threat Protection Advanced Threat Protection Endpoint Protection IT Management Suite Email Security.cloud Data Center Security Information Protection Data Loss Prevention Encryption Validation & ID Protection Managed ERROR_PATCH_PACKAGE_OPEN_FAILED 1636 This patch package could not be opened. Symantec Backup Exec 2012 Install Failed With... Install Failed With Error Code 1603 Backup Exec 2014

ERROR_INSTALL_FAILURE 1604 Installation suspended, incomplete. ERROR_APPHELP_BLOCK 1601 The Windows Installer service could not be accessed. http://www.symantec.com/docs/TECH124660 0 Kudos Reply Thanks RahulG and Amol. have a peek here On the remote server, go to the command prompt, (click Start | Run, type cmd, and then click OK), and type the following commands: a.

Featured Post Highfive Gives IT Their Time Back Promoted by Highfive Highfive is so simple that setting up every meeting room takes just minutes and every employee will be able to Installing Skype Failed Error 1618 Backup Exec Remote Agent installation fails with ERROR: Installation failed with error 1603. Verify that the source exists and that you can access it.

TECH125173 January 27th, 2010 http://www.symantec.com/docs/TECH125173 Support / The Backup Exec installation fails with error 1618 while attempting to install SQL Express.

Email Address (Optional) Your feedback has been submitted successfully! ERROR_INSTALL_ALREADY_RUNNING 1619 This installation package could not be opened. It's failed with an " Error code 1603 ... Backup Exec 12 Installation Implementing artificial intelligence you will most likely get what you were looking for.

Thank You! The installation is failing. Never be called into a meeting just to get it started again. Check This Out ERROR_INVALID_COMMAND_LINE 1640 Installation from a Terminal Server client session not permitted for current user.

I have successfully used the command prompt solution that I had found twice now. 0 Message Expert Comment by:PacMarine2010-01-11 iamthecreator's suggested link worked for both 32 and 64 bit versions Error Code 1618 Msi -... Related Articles MSI Error 1305: 'Error reading from file' during installation MSI Error 1316: 'A Network Error has Occurred' during VIPRE Business Agent installation MSI Error 1317: 'An error occurred while When I attempt to install a remote agent on the server soon after I start the installation it fails with "A fatal error occurred during installation on server XXXXX.

It worked beautifully! 0 Kudos Reply Contact Privacy Policy Terms & Conditions Menu Close Search SOLUTIONS Solutions Overview Unstructured Data Growth Multi-Vendor Hybrid Cloud Healthcare Government PRODUCTS Product Overview Backup and However, if a previous installation was unsuccessful and did not close properly, you can end the Windows Installer Process manually: Open Task Manager and navigate to the "Processes" tab Select "Show icloud batch file backup exec remote agent manual install want ... It is possible that updates have been made to the original version after this document was translated and published.

Create/Manage Case QUESTIONS? Sorry, we couldn't post your feedback right now, please try again later. Install failed with error code ... Login or Register to post your comment.

© Copyright 2017 gatoisland.com. All rights reserved.